Reaction Details
TargetDual specificity protein kinase CLK2
LigandBDBM50235037
Substrate/Competitorn/a
Meas. Tech.ChEMBL_1654403 (CHEMBL4003769)
IC50 28±n/a nM
Citation Shi, YPark, JLagisetti, CZhou, WSambucetti, LCWebb, TR A triple exon-skipping luciferase reporter assay identifies a new CLK inhibitor pharmacophore. Bioorg Med Chem Lett27:406-412 (2017) 
 
Dual specificity protein kinase CLK2
Name:Dual specificity protein kinase CLK2
Type:n/a
Mol. Mass.:60128.79
Organism:Homo sapiens (Human)
Description:P49760
Residue:499
BDBM50235037
NameBDBM50235037
Synonyms:CHEMBL4102101
TypeSmall organic molecule
Emp. Form.C18H23ClN8
Mol. Mass.386.882
SMILESCC(C)n1cnc2c(Nc3cc(N)cc(Cl)c3)nc(N[C@H]3CCNC3)nc12