Reaction Details
TargetDual specificity protein kinase CLK4
LigandBDBM50235021
Substrate/Competitorn/a
Meas. Tech.ChEMBL_1654405 (CHEMBL4003771)
IC50 28±n/a nM
Citation Shi, YPark, JLagisetti, CZhou, WSambucetti, LCWebb, TR A triple exon-skipping luciferase reporter assay identifies a new CLK inhibitor pharmacophore. Bioorg Med Chem Lett27:406-412 (2017) 
 
Dual specificity protein kinase CLK4
Name:Dual specificity protein kinase CLK4
Type:Serine/threonine-protein kinase
Mol. Mass.:57522.53
Organism:Homo sapiens (Human)
Description:gi_10190706
Residue:481
BDBM50235021
NameBDBM50235021
Synonyms:CHEMBL4104657
TypeSmall organic molecule
Emp. Form.C20H27ClN8
Mol. Mass.414.935
SMILESCC(C)n1cnc2c(Nc3cc(N)cc(Cl)c3)nc(N[C@H]3CCCC[C@H]3N)nc12