Reaction Details
TargetCyclin-dependent kinase 6/G1/S-specific cyclin-D3
LigandBDBM50073765
Substrate/Competitorn/a
Meas. Tech.ChEMBL_1654408 (CHEMBL4003774)
IC50>1000±n/a nM
Citation Shi, YPark, JLagisetti, CZhou, WSambucetti, LCWebb, TR A triple exon-skipping luciferase reporter assay identifies a new CLK inhibitor pharmacophore. Bioorg Med Chem Lett27:406-412 (2017) 
 
Cyclin-dependent kinase 6/G1/S-specific cyclin-D3
Name:Cyclin-dependent kinase 6/G1/S-specific cyclin-D3
Type:Protein
Mol. Mass.:n/a
Description:n/a
Components:This complex has 2 components.
Component 1
Name:Cyclin-dependent kinase 6
Synonyms:CDK6 CDKN6 Cyclin-dependent kinase 6 (CDK 6) | Serine/threonine-protein kinase PLSTIRE
Type:Enzyme Subunit
Mol. Mass.:36937.42
Organism:Homo sapiens (Human)
Description:Q00534
Residue:326
Component 2
Name:G1/S-specific cyclin-D3
Synonyms:CCND3 | CCND3_HUMAN
Type:Enzyme
Mol. Mass.:32521.90
Organism:Homo sapiens (Human)
Description:P30281
Residue:292
BDBM50073765
NameBDBM50073765
Synonyms:CHEMBL367625 | N*2*-((1R,2S)-2-Amino-cyclohexyl)-N*6*-(3-chloro-phenyl)-9-ethyl-9H-purine-2,6-diamine
TypeSmall organic molecule
Emp. Form.C19H24ClN7
Mol. Mass.385.894
SMILESCCn1cnc2c(Nc3cccc(Cl)c3)nc(N[C@@H]3CCCC[C@@H]3N)nc12