Reaction Details
TargetHistone deacetylase 1
LigandBDBM50235296
Substrate/Competitorn/a
Meas. Tech.ChEMBL_1655197 (CHEMBL4004563)
IC50 3.8±n/a nM
Citation Raji, IAhluwalia, KOyelere, AK Design, synthesis and evaluation of antiproliferative activity of melanoma-targeted histone deacetylase inhibitors. Bioorg Med Chem Lett27:744-749 (2017) 
 
Histone deacetylase 1
Name:Histone deacetylase 1
Type:Enzyme
Mol. Mass.:55090.27
Organism:Homo sapiens (Human)
Description:Q13547
Residue:482
BDBM50235296
NameBDBM50235296
Synonyms:CHEMBL4096623
TypeSmall organic molecule
Emp. Form.C22H34N6O3
Mol. Mass.430.5438
SMILESCCN(CC)CCNC(=O)c1ccc(cc1)-c1cn(CCCCCCC(=O)NO)nn1