Reaction Details
TargetEukaryotic initiation factor 4A-I
LigandBDBM50235738
Substrate/Competitorn/a
Meas. Tech.ChEMBL_1657826 (CHEMBL4007296)
IC50 3100±n/a nM
Citation Ito, MIwatani, MKamada, YSogabe, SNakao, STanaka, TKawamoto, TAparicio, SNakanishi, AImaeda, Y Discovery of selective ATP-competitive eIF4A3 inhibitors. Bioorg Med Chem25:2200-2209 (2017) 
 
Eukaryotic initiation factor 4A-I
Name:Eukaryotic initiation factor 4A-I
Type:PROTEIN
Mol. Mass.:46146.87
Organism:Homo sapiens (Human)
Description:ChEMBL_864983
Residue:406
BDBM50235738
NameBDBM50235738
Synonyms:Hippuristanol
TypeSmall organic molecule
Emp. Form.C28H46O5
Mol. Mass.462.6618
SMILES[H][C@]12C[C@@]3([H])[C@]4([H])CC[C@@]5([H])C[C@H](O)CC[C@]5(C)[C@@]4([H])[C@@H](O)C[C@]3(C)[C@@]1([H])[C@@](C)(O)[C@]1(C[C@H](C)C(C)(C)O1)O2