Reaction Details
TargetBeta-galactosidase
LigandBDBM50235812
Substrate/Competitorn/a
Meas. Tech.ChEMBL_1657978 (CHEMBL4007590)
IC50 8.0±n/a nM
Citation Front, SBiela-Banas, ABurda, PBallhausen, DHigaki, KCaciotti, AMorrone, ACharollais-Thoenig, JGallienne, EDemotz, SMartin, OR (5aR)-5a-C-Pentyl-4-epi-isofagomine: A powerful inhibitor of lysosomalß-galactosidase and a remarkable chaperone for mutations associated with GM1-gangliosidosis and Morquio disease type B. Eur J Med Chem126:160-170 (2017) 
 
Beta-galactosidase
Name:Beta-galactosidase
Type:PROTEIN
Mol. Mass.:76074.43
Organism:Homo sapiens (Human)
Description:ChEMBL_215886
Residue:677
BDBM50235812
NameBDBM50235812
Synonyms:CHEMBL4085739
TypeSmall organic molecule
Emp. Form.C11H23NO3
Mol. Mass.217.3052
SMILESCCCCC[C@H]1NC[C@@H](O)[C@@H](O)[C@H]1CO