Reaction Details
TargetBeta-galactosidase
LigandBDBM50350758
Substrate/Competitorn/a
Meas. Tech.ChEMBL_1657978 (CHEMBL4007590)
IC50 240±n/a nM
Citation Front, SBiela-Banas, ABurda, PBallhausen, DHigaki, KCaciotti, AMorrone, ACharollais-Thoenig, JGallienne, EDemotz, SMartin, OR (5aR)-5a-C-Pentyl-4-epi-isofagomine: A powerful inhibitor of lysosomalß-galactosidase and a remarkable chaperone for mutations associated with GM1-gangliosidosis and Morquio disease type B. Eur J Med Chem126:160-170 (2017) 
 
Beta-galactosidase
Name:Beta-galactosidase
Type:PROTEIN
Mol. Mass.:76074.43
Organism:Homo sapiens (Human)
Description:ChEMBL_215886
Residue:677
BDBM50350758
NameBDBM50350758
Synonyms:CHEMBL1818433
TypeSmall organic molecule
Emp. Form.C6H13NO3
Mol. Mass.147.1723
SMILESOC[C@H]1CNC[C@@H](O)[C@H]1O