Reaction Details
TargetLysine-specific histone demethylase 2
LigandBDBM50236360
Substrate/Competitorn/a
Meas. Tech.ChEMBL_1659160 (CHEMBL4008772)
IC50>100000±n/a nM
Citation Sartori, LMercurio, CAmigoni, FCappa, AFagá, GFattori, RLegnaghi, ECiossani, GMattevi, AMeroni, GMoretti, LCecatiello, VPasqualato, SRomussi, AThaler, FTrifiró, PVilla, MVultaggio, SBotrugno, OADessanti, PMinucci, SZagarrí, ECarettoni, DIuzzolino, LVarasi, MVianello, P Thieno[3,2-b]pyrrole-5-carboxamides as New Reversible Inhibitors of Histone Lysine Demethylase KDM1A/LSD1. Part 1: High-Throughput Screening and Preliminary Exploration. J Med Chem60:1673-1692 (2017) 
 
Lysine-specific histone demethylase 2
Name:Lysine-specific histone demethylase 2
Type:PROTEIN
Mol. Mass.:92112.91
Organism:Homo sapiens (Human)
Description:ChEMBL_992590
Residue:822
BDBM50236360
NameBDBM50236360
Synonyms:CHEMBL4066708
TypeSmall organic molecule
Emp. Form.C16H16N2O2S
Mol. Mass.300.375
SMILESCOCc1cccc(NC(=O)c2cc3sccc3n2C)c1