Reaction Details
TargetLysine-specific histone demethylase 1A/REST corepressor 1
LigandBDBM254603
Substrate/Competitorn/a
Meas. Tech.ChEMBL_1659154 (CHEMBL4008766)
IC50 0.600000±n/a nM
Citation Sartori, LMercurio, CAmigoni, FCappa, AFagá, GFattori, RLegnaghi, ECiossani, GMattevi, AMeroni, GMoretti, LCecatiello, VPasqualato, SRomussi, AThaler, FTrifiró, PVilla, MVultaggio, SBotrugno, OADessanti, PMinucci, SZagarrí, ECarettoni, DIuzzolino, LVarasi, MVianello, P Thieno[3,2-b]pyrrole-5-carboxamides as New Reversible Inhibitors of Histone Lysine Demethylase KDM1A/LSD1. Part 1: High-Throughput Screening and Preliminary Exploration. J Med Chem60:1673-1692 (2017) 
 
Lysine-specific histone demethylase 1A/REST corepressor 1
Name:Lysine-specific histone demethylase 1A/REST corepressor 1
Synonyms:LSD1/CoREST complex
Type:n/a
Mol. Mass.:n/a
Description:ASSAY_ID of ChEMBL is 1659159
Components:This complex has 2 components.
Component 1
Name:Lysine-specific histone demethylase 1A
Type:Enzyme
Mol. Mass.:92901.01
Organism:Homo sapiens (Human)
Description:O60341
Residue:852
Component 2
Name:REST corepressor 1
Synonyms:KIAA0071 RCOR RCOR1_HUMAN | REST corepressor 1
Type:PROTEIN
Mol. Mass.:53329.34
Organism:Homo sapiens (Human)
Description:ChEMBL_108118
Residue:485
BDBM254603
NameBDBM254603
Synonyms:US10214477, Example 5 US9670136, 3 (trans)-N1-((1S,2R)-2-phenylcyclopropyl)cyclohexane-1,4-diamine
TypeSmall organic molecule
Emp. Form.C15H22N2
Mol. Mass.230.3486
SMILESNC1CCC(CC1)N[C@@H]1C[C@H]1c1ccccc1