Reaction Details
TargetLysine-specific histone demethylase 2
LigandBDBM50236365
Substrate/Competitorn/a
Meas. Tech.ChEMBL_1659160 (CHEMBL4008772)
IC50>100000±n/a nM
Citation Sartori, LMercurio, CAmigoni, FCappa, AFagá, GFattori, RLegnaghi, ECiossani, GMattevi, AMeroni, GMoretti, LCecatiello, VPasqualato, SRomussi, AThaler, FTrifiró, PVilla, MVultaggio, SBotrugno, OADessanti, PMinucci, SZagarrí, ECarettoni, DIuzzolino, LVarasi, MVianello, P Thieno[3,2-b]pyrrole-5-carboxamides as New Reversible Inhibitors of Histone Lysine Demethylase KDM1A/LSD1. Part 1: High-Throughput Screening and Preliminary Exploration. J Med Chem60:1673-1692 (2017) 
 
Lysine-specific histone demethylase 2
Name:Lysine-specific histone demethylase 2
Type:PROTEIN
Mol. Mass.:92112.91
Organism:Homo sapiens (Human)
Description:ChEMBL_992590
Residue:822
BDBM50236365
NameBDBM50236365
Synonyms:CHEMBL4090002
TypeSmall organic molecule
Emp. Form.C27H29N3O3S
Mol. Mass.475.602
SMILESCN1CCC(CC1)Oc1ccc(OCc2cccc(NC(=O)c3cc4sccc4n3C)c2)cc1