Reaction Details
TargetLysine-specific histone demethylase 1A/REST corepressor 1
LigandBDBM50236447
Substrate/Competitorn/a
Meas. Tech.ChEMBL_1659178 (CHEMBL4008790)
IC50 6.7±n/a nM
Citation Vianello, PSartori, LAmigoni, FCappa, AFagá, GFattori, RLegnaghi, ECiossani, GMattevi, AMeroni, GMoretti, LCecatiello, VPasqualato, SRomussi, AThaler, FTrifiró, PVilla, MBotrugno, OADessanti, PMinucci, SVultaggio, SZagarrí, EVarasi, MMercurio, C Thieno[3,2-b]pyrrole-5-carboxamides as New Reversible Inhibitors of Histone Lysine Demethylase KDM1A/LSD1. Part 2: Structure-Based Drug Design and Structure-Activity Relationship. J Med Chem60:1693-1715 (2017) 
 
Lysine-specific histone demethylase 1A/REST corepressor 1
Name:Lysine-specific histone demethylase 1A/REST corepressor 1
Synonyms:LSD1/CoREST complex
Type:n/a
Mol. Mass.:n/a
Description:ASSAY_ID of ChEMBL is 1659159
Components:This complex has 2 components.
Component 1
Name:Lysine-specific histone demethylase 1A
Type:Enzyme
Mol. Mass.:92901.01
Organism:Homo sapiens (Human)
Description:O60341
Residue:852
Component 2
Name:REST corepressor 1
Synonyms:KIAA0071 RCOR RCOR1_HUMAN | REST corepressor 1
Type:PROTEIN
Mol. Mass.:53329.34
Organism:Homo sapiens (Human)
Description:ChEMBL_108118
Residue:485
BDBM50236447
NameBDBM50236447
Synonyms:CHEMBL4069817
TypeSmall organic molecule
Emp. Form.C29H33N3O4S
Mol. Mass.519.655
SMILESCCn1c(cc2sccc12)C(=O)Nc1cccc(COC)c1COc1ccc(OC[C@@H]2CCNC2)cc1