Reaction Details
TargetDual specificity tyrosine-phosphorylation-regulated kinase 1A
LigandBDBM50236538
Substrate/Competitorn/a
Meas. Tech.ChEMBL_1659283 (CHEMBL4008895)
IC50>1000±n/a nM
Citation Zhou, QPhoa, AFAbbassi, RHHoque, MReekie, TAFont, JSRyan, RMStringer, BWDay, BWJohns, TGMunoz, LKassiou, M Structural Optimization and Pharmacological Evaluation of Inhibitors Targeting Dual-Specificity Tyrosine Phosphorylation-Regulated Kinases (DYRK) and CDC-like kinases (CLK) in Glioblastoma. J Med Chem60:2052-2070 (2017) 
 
Dual specificity tyrosine-phosphorylation-regulated kinase 1A
Name:Dual specificity tyrosine-phosphorylation-regulated kinase 1A
Type:Enzyme
Mol. Mass.:85616.61
Organism:Homo sapiens (Human)
Description:Q13627
Residue:763
BDBM50236538
NameBDBM50236538
Synonyms:CHEMBL4083661
TypeSmall organic molecule
Emp. Form.C19H14N2O2
Mol. Mass.302.3267
SMILESOc1ccc(cc1)-c1n[nH]c2ccc(cc12)-c1ccc(O)cc1