Reaction Details
TargetDual specificity tyrosine-phosphorylation-regulated kinase 1A
LigandBDBM50236549
Substrate/Competitorn/a
Meas. Tech.ChEMBL_1659283 (CHEMBL4008895)
IC50>1000±n/a nM
Citation Zhou, QPhoa, AFAbbassi, RHHoque, MReekie, TAFont, JSRyan, RMStringer, BWDay, BWJohns, TGMunoz, LKassiou, M Structural Optimization and Pharmacological Evaluation of Inhibitors Targeting Dual-Specificity Tyrosine Phosphorylation-Regulated Kinases (DYRK) and CDC-like kinases (CLK) in Glioblastoma. J Med Chem60:2052-2070 (2017) 
 
Dual specificity tyrosine-phosphorylation-regulated kinase 1A
Name:Dual specificity tyrosine-phosphorylation-regulated kinase 1A
Type:Enzyme
Mol. Mass.:85616.61
Organism:Homo sapiens (Human)
Description:Q13627
Residue:763
BDBM50236549
NameBDBM50236549
Synonyms:CHEMBL4070354
TypeSmall organic molecule
Emp. Form.C20H15N3O3
Mol. Mass.345.3514
SMILESOc1ccc(NC(=O)c2c[nH]c3ncc(cc23)-c2ccc(O)cc2)cc1