Reaction Details
TargetDual specificity tyrosine-phosphorylation-regulated kinase 1A
LigandBDBM50236547
Substrate/Competitorn/a
Meas. Tech.ChEMBL_1659283 (CHEMBL4008895)
IC50 212±n/a nM
Citation Zhou, QPhoa, AFAbbassi, RHHoque, MReekie, TAFont, JSRyan, RMStringer, BWDay, BWJohns, TGMunoz, LKassiou, M Structural Optimization and Pharmacological Evaluation of Inhibitors Targeting Dual-Specificity Tyrosine Phosphorylation-Regulated Kinases (DYRK) and CDC-like kinases (CLK) in Glioblastoma. J Med Chem60:2052-2070 (2017) 
 
Dual specificity tyrosine-phosphorylation-regulated kinase 1A
Name:Dual specificity tyrosine-phosphorylation-regulated kinase 1A
Type:Enzyme
Mol. Mass.:85616.61
Organism:Homo sapiens (Human)
Description:Q13627
Residue:763
BDBM50236547
NameBDBM50236547
Synonyms:CHEMBL4075959
TypeSmall organic molecule
Emp. Form.C19H13N3O3
Mol. Mass.331.3248
SMILESOc1ccc(cc1)-c1c[nH]c2ncc(cc12)-c1ccc(cc1)[N+]([O-])=O