Reaction Details
TargetNAD-dependent protein deacetylase sirtuin-2
LigandBDBM50236570
Substrate/Competitorn/a
Meas. Tech.ChEMBL_1660310 (CHEMBL4009922)
Ki 2220±n/a nM
Citation Moniot, SForgione, MLucidi, AHailu, GSNebbioso, ACarafa, VBaratta, FAltucci, LGiacché, NPasseri, DPellicciari, RMai, ASteegborn, CRotili, D Development of 1,2,4-Oxadiazoles as Potent and Selective Inhibitors of the Human Deacetylase Sirtuin 2: Structure-Activity Relationship, X-ray Crystal Structure, and Anticancer Activity. J Med Chem60:2344-2360 (2017) 
 
NAD-dependent protein deacetylase sirtuin-2
Name:NAD-dependent protein deacetylase sirtuin-2
Type:Hydrolase
Mol. Mass.:43172.62
Organism:Homo sapiens (Human)
Description:n/a
Residue:389
BDBM50236570
NameBDBM50236570
Synonyms:CHEMBL4072206
TypeSmall organic molecule
Emp. Form.C11H10Br2N2O
Mol. Mass.346.018
SMILESBrCCCc1nc(no1)-c1ccc(Br)cc1