Reaction Details
TargetSodium-dependent serotonin transporter
LigandBDBM50010588
Substrate/Competitorn/a
Meas. Tech.ChEBML_1660354
EC50 72±n/a nM
Citation Glennon, RA The 2014 Philip S. Portoghese Medicinal Chemistry Lectureship: The"Phenylalkylaminome" with a Focus on Selected Drugs of Abuse. J Med Chem60:2605-2628 (2017) 
 
Sodium-dependent serotonin transporter
Name:Sodium-dependent serotonin transporter
Type:Multi-pass membrane protein
Mol. Mass.:70168.43
Organism:Rattus norvegicus (rat)
Description:P31652
Residue:630
BDBM50010588
NameBDBM50010588
Synonyms:(RS)-3,4-(methylenedioxy)methamphetamine 1-(1,3-benzodioxol-5-yl)-N-methylpropan-2-amine CHEMBL43048 MDMA N-Methyl-3,4-methylenedioxyamphetamine | US11767305, Compound MDMA
TypeSmall organic molecule
Emp. Form.C11H15NO2
Mol. Mass.193.2423
SMILESCNC(C)Cc1ccc2OCOc2c1