Reaction Details
TargetSigma non-opioid intracellular receptor 1
LigandBDBM50236721
Substrate/Competitorn/a
Meas. Tech.ChEMBL_1660368 (CHEMBL4009980)
Ki 0.080000±n/a nM
Citation Glennon, RA The 2014 Philip S. Portoghese Medicinal Chemistry Lectureship: The"Phenylalkylaminome" with a Focus on Selected Drugs of Abuse. J Med Chem60:2605-2628 (2017) 
 
Sigma non-opioid intracellular receptor 1
Name:Sigma non-opioid intracellular receptor 1
Type:Protein
Mol. Mass.:25307.17
Organism:Cavia porcellus (Guinea pig)
Description:Q60492
Residue:223
BDBM50236721
NameBDBM50236721
Synonyms:CHEMBL4073530
TypeSmall organic molecule
Emp. Form.C23H31N
Mol. Mass.321.4989
SMILESC(CCN1CCCCC1Cc1ccccc1)CCc1ccccc1