Reaction Details
TargetSodium-dependent serotonin transporter
LigandBDBM50025212
Substrate/Competitorn/a
Meas. Tech.ChEMBL_1660354 (CHEMBL4009966)
EC50 68±n/a nM
Citation Glennon, RA The 2014 Philip S. Portoghese Medicinal Chemistry Lectureship: The"Phenylalkylaminome" with a Focus on Selected Drugs of Abuse. J Med Chem60:2605-2628 (2017) 
 
Sodium-dependent serotonin transporter
Name:Sodium-dependent serotonin transporter
Type:Multi-pass membrane protein
Mol. Mass.:70168.43
Organism:Rattus norvegicus (rat)
Description:P31652
Residue:630
BDBM50025212
NameBDBM50025212
Synonyms:CHEMBL3330646
TypeSmall organic molecule
Emp. Form.C12H16N2
Mol. Mass.188.2688
SMILESCC[C@@H](N)Cc1c[nH]c2ccccc12