Reaction Details
TargetSodium-dependent serotonin transporter
LigandBDBM84738
Substrate/Competitorn/a
Meas. Tech.ChEMBL_1660354 (CHEMBL4009966)
EC50 108±n/a nM
Citation Glennon, RA The 2014 Philip S. Portoghese Medicinal Chemistry Lectureship: The"Phenylalkylaminome" with a Focus on Selected Drugs of Abuse. J Med Chem60:2605-2628 (2017) 
 
Sodium-dependent serotonin transporter
Name:Sodium-dependent serotonin transporter
Type:Multi-pass membrane protein
Mol. Mass.:70168.43
Organism:Rattus norvegicus (rat)
Description:P31652
Residue:630
BDBM84738
NameBDBM84738
Synonyms:CAS_16105-77-4 Fenfluramine (+) NSC_3337 | d-Fenfluramine
TypeSmall organic molecule
Emp. Form.C12H16F3N
Mol. Mass.231.2573
SMILESCCNC(C)Cc1cccc(c1)C(F)(F)F