Reaction Details
TargetZinc finger protein 664
LigandBDBM50001028
Substrate/Competitorn/a
Meas. Tech.ChEBML_1659535
Ki 5.4±n/a nM
Citation Soeberdt, MMolenveld, PStorcken, RPBouzanne des Mazery, RSterk, GJAutar, RBolster, MGWagner, CAerts, SNvan Holst, FRWegert, ATangherlini, GFrehland, BSchepmann, DMetze, DLotts, TKnie, ULin, KYHuang, TYLai, CCStänder, SWünsch, BAbels, C Design and Synthesis of Enantiomerically Pure Decahydroquinoxalines as Potent and Selective¿-Opioid Receptor Agonists with Anti-Inflammatory Activity in Vivo. J Med Chem60:2526-2551 (2017) 
 
Zinc finger protein 664
Name:Zinc finger protein 664
Type:PROTEIN
Mol. Mass.:30308.74
Organism:Cavia porcellus
Description:ChEMBL_117362
Residue:261
BDBM50001028
NameBDBM50001028
Synonyms:(+)-PENTAZOCINE (2R,6R,11R)-6,11-Dimethyl-3-(3-methyl-but-2-enyl)-1,2,3,4,5,6-hexahydro-2,6-methano-benzo[d]azocin-8-ol 6,11-Dimethyl-3-(3-methyl-but-2-enyl)-1,2,3,4,5,6-hexahydro-2,6-methano-benzo[d]azocin-8-ol CHEMBL560 PENTAZOCINE (-) Pentazocine,(+/-) Talwin US10736890, Compound TABLE B.8 US9656961, Example 00125 | rel-(2R,6R,11R)-6,11-Dimethyl-3-(3-methyl-but-2-enyl)-1,2,3,4,5,6-hexahydro-2,6-methano-benzo[d]azocin-8-ol
TypeSmall organic molecule
Emp. Form.C19H27NO
Mol. Mass.285.4238
SMILES[#6]-[#6@H]1-[#6@H]-2-[#6]-c3ccc(-[#8])cc3[C@]1([#6])[#6]-[#6]-[#7]-2-[#6]\[#6]=[#6](\[#6])-[#6]