Reaction Details
TargetKappa-type opioid receptor
LigandBDBM50236873
Substrate/Competitorn/a
Meas. Tech.ChEBML_1659529
Ki 1.3±n/a nM
Citation Soeberdt, MMolenveld, PStorcken, RPBouzanne des Mazery, RSterk, GJAutar, RBolster, MGWagner, CAerts, SNvan Holst, FRWegert, ATangherlini, GFrehland, BSchepmann, DMetze, DLotts, TKnie, ULin, KYHuang, TYLai, CCStänder, SWünsch, BAbels, C Design and Synthesis of Enantiomerically Pure Decahydroquinoxalines as Potent and Selective¿-Opioid Receptor Agonists with Anti-Inflammatory Activity in Vivo. J Med Chem60:2526-2551 (2017) 
 
Kappa-type opioid receptor
Name:Kappa-type opioid receptor
Type:G Protein-Coupled Receptor (GPCR)
Mol. Mass.:42744.99
Organism:Cavia porcellus (domestic guinea pig)
Description:P41144
Residue:380
BDBM50236873
NameBDBM50236873
Synonyms:CHEMBL4099840
TypeSmall organic molecule
Emp. Form.C22H29Cl2N3O4
Mol. Mass.470.389
SMILES[H][C@]12CCC[C@H](N3CC[C@@H](O)C3)[C@@]1([H])N(CCN2C(=O)OC)C(=O)Cc1ccc(Cl)c(Cl)c1