Reaction Details
TargetAldehyde dehydrogenase family 1 member A3
LigandBDBM50236900
Substrate/Competitorn/a
Meas. Tech.ChEMBL_1659729 (CHEMBL4009341)
IC50 270±n/a nM
Citation Buchman, CDHurley, TD Inhibition of the Aldehyde Dehydrogenase 1/2 Family by Psoralen and Coumarin Derivatives. J Med Chem60:2439-2455 (2017) 
 
Aldehyde dehydrogenase family 1 member A3
Name:Aldehyde dehydrogenase family 1 member A3
Type:PROTEIN
Mol. Mass.:56110.85
Organism:Homo sapiens (Human)
Description:ChEMBL_109700
Residue:512
BDBM50236900
NameBDBM50236900
Synonyms:CHEMBL4072941
TypeSmall organic molecule
Emp. Form.C15H14O3
Mol. Mass.242.2699
SMILESCc1oc2cc3oc(=O)c(C)c(C)c3cc2c1C