Reaction Details
TargetAldehyde dehydrogenase family 1 member A3
LigandBDBM50236905
Substrate/Competitorn/a
Meas. Tech.ChEMBL_1659729 (CHEMBL4009341)
IC50 170±n/a nM
Citation Buchman, CDHurley, TD Inhibition of the Aldehyde Dehydrogenase 1/2 Family by Psoralen and Coumarin Derivatives. J Med Chem60:2439-2455 (2017) 
 
Aldehyde dehydrogenase family 1 member A3
Name:Aldehyde dehydrogenase family 1 member A3
Type:PROTEIN
Mol. Mass.:56110.85
Organism:Homo sapiens (Human)
Description:ChEMBL_109700
Residue:512
BDBM50236905
NameBDBM50236905
Synonyms:CHEMBL1349972
TypeSmall organic molecule
Emp. Form.C16H14O3
Mol. Mass.254.2806
SMILESCc1oc2cc3oc(=O)c4CCCc4c3cc2c1C