Reaction Details
TargetAldehyde dehydrogenase, mitochondrial
LigandBDBM50303403
Substrate/Competitorn/a
Meas. Tech.ChEMBL_1659744 (CHEMBL4009356)
Ki 5600±n/a nM
Citation Buchman, CDHurley, TD Inhibition of the Aldehyde Dehydrogenase 1/2 Family by Psoralen and Coumarin Derivatives. J Med Chem60:2439-2455 (2017) 
 
Aldehyde dehydrogenase, mitochondrial
Name:Aldehyde dehydrogenase, mitochondrial
Type:Enzyme
Mol. Mass.:56382.67
Organism:Homo sapiens (Human)
Description:P05091
Residue:517
BDBM50303403
NameBDBM50303403
Synonyms:2-(4-methyl-2-oxo-2H-chromen-7-yloxy)acetonitrile cid_1633306
TypeSmall organic molecule
Emp. Form.C12H9NO3
Mol. Mass.215.2048
SMILESCc1cc(=O)oc2cc(OCC#N)ccc12