Reaction Details
TargetAldehyde dehydrogenase 1A1
LigandBDBM50078833
Substrate/Competitorn/a
Meas. Tech.ChEMBL_1659743 (CHEMBL4009355)
Ki 1200±n/a nM
Citation Buchman, CDHurley, TD Inhibition of the Aldehyde Dehydrogenase 1/2 Family by Psoralen and Coumarin Derivatives. J Med Chem60:2439-2455 (2017) 
 
Aldehyde dehydrogenase 1A1
Name:Aldehyde dehydrogenase 1A1
Type:Protein
Mol. Mass.:54862.21
Organism:Homo sapiens (Human)
Description:n/a
Residue:501
BDBM50078833
NameBDBM50078833
Synonyms:4-Methyl-7-(diethylamino)coumarin CHEMBL315348 Coumarin 47 | coumarin 460
TypeSmall organic molecule
Emp. Form.C14H17NO2
Mol. Mass.231.2903
SMILESCCN(CC)c1ccc2c(C)cc(=O)oc2c1