Reaction Details
TargetRetinal dehydrogenase 2
LigandBDBM50236909
Substrate/Competitorn/a
Meas. Tech.ChEMBL_1659727 (CHEMBL4009339)
IC50 65±n/a nM
Citation Buchman, CDHurley, TD Inhibition of the Aldehyde Dehydrogenase 1/2 Family by Psoralen and Coumarin Derivatives. J Med Chem60:2439-2455 (2017) 
 
Retinal dehydrogenase 2
Name:Retinal dehydrogenase 2
Type:PROTEIN
Mol. Mass.:56720.77
Organism:Homo sapiens (Human)
Description:ChEMBL_109700
Residue:518
BDBM50236909
NameBDBM50236909
Synonyms:CHEMBL4090473
TypeSmall organic molecule
Emp. Form.C17H16O3
Mol. Mass.268.3071
SMILESCc1oc2cc3oc(=O)c4CCCCc4c3cc2c1C