Reaction Details
TargetRetinal dehydrogenase 2
LigandBDBM50236908
Substrate/Competitorn/a
Meas. Tech.ChEMBL_1659727 (CHEMBL4009339)
IC50 69±n/a nM
Citation Buchman, CDHurley, TD Inhibition of the Aldehyde Dehydrogenase 1/2 Family by Psoralen and Coumarin Derivatives. J Med Chem60:2439-2455 (2017) 
 
Retinal dehydrogenase 2
Name:Retinal dehydrogenase 2
Type:PROTEIN
Mol. Mass.:56720.77
Organism:Homo sapiens (Human)
Description:ChEMBL_109700
Residue:518
BDBM50236908
NameBDBM50236908
Synonyms:CHEMBL1562069
TypeSmall organic molecule
Emp. Form.C16H16O3
Mol. Mass.256.2964
SMILESCCCc1cc(=O)oc2cc3oc(C)c(C)c3cc12