Reaction Details
TargetFocal adhesion kinase 1
LigandBDBM50236987
Substrate/Competitorn/a
Meas. Tech.ChEMBL_1661305 (CHEMBL4010917)
IC50 230±n/a nM
Citation Dao, PLietha, DEtheve-Quelquejeu, MGarbay, CChen, H Synthesis of novel 1,2,4-triazine scaffold as FAK inhibitors with antitumor activity. Bioorg Med Chem Lett27:1727-1730 (2017) 
 
Focal adhesion kinase 1
Name:Focal adhesion kinase 1
Type:Tyrosine-protein kinase
Mol. Mass.:119233.17
Organism:Homo sapiens (Human)
Description:Q05397
Residue:1052
BDBM50236987
NameBDBM50236987
Synonyms:CHEMBL4097578
TypeSmall organic molecule
Emp. Form.C22H24ClN7O3
Mol. Mass.469.924
SMILESCNC(=O)c1ccccc1Nc1nc(Nc2ccc(cc2OC)N2CCOCC2)nnc1Cl