Reaction Details
TargetCarbonic anhydrase 2
LigandBDBM50237174
Substrate/Competitorn/a
Meas. Tech.ChEBML_1660630
Ki 8.8±n/a nM
Citation Mishra, CBKumari, SAngeli, AMonti, SMBuonanno, MTiwari, MSupuran, CT Discovery of Benzenesulfonamides with Potent Human Carbonic Anhydrase Inhibitory and Effective Anticonvulsant Action: Design, Synthesis, and Pharmacological Assessment. J Med Chem60:2456-2469 (2017) 
 
Carbonic anhydrase 2
Name:Carbonic anhydrase 2
Type:Enzyme
Mol. Mass.:29250.71
Organism:Homo sapiens (Human)
Description:P00918
Residue:260
BDBM50237174
NameBDBM50237174
Synonyms:CHEMBL4074004
TypeSmall organic molecule
Emp. Form.C19H24ClN5O3S
Mol. Mass.437.944
SMILESNS(=O)(=O)c1ccc(NC(=O)NCCN2CCN(CC2)c2ccc(Cl)cc2)cc1