Reaction Details
TargetCarbonic anhydrase 7
LigandBDBM50237175
Substrate/Competitorn/a
Meas. Tech.ChEBML_1660631
Ki 360±n/a nM
Citation Mishra, CBKumari, SAngeli, AMonti, SMBuonanno, MTiwari, MSupuran, CT Discovery of Benzenesulfonamides with Potent Human Carbonic Anhydrase Inhibitory and Effective Anticonvulsant Action: Design, Synthesis, and Pharmacological Assessment. J Med Chem60:2456-2469 (2017) 
 
Carbonic anhydrase 7
Name:Carbonic anhydrase 7
Type:Enzyme
Mol. Mass.:29664.11
Organism:Homo sapiens (Human)
Description:Human cloned isozyme.
Residue:264
BDBM50237175
NameBDBM50237175
Synonyms:CHEMBL4098919
TypeSmall organic molecule
Emp. Form.C21H27N5O5S
Mol. Mass.461.535
SMILESNS(=O)(=O)c1ccc(NC(=O)NCCN2CCN(Cc3ccc4OCOc4c3)CC2)cc1