Reaction Details
TargetCarbonic anhydrase 7
LigandBDBM50237178
Substrate/Competitorn/a
Meas. Tech.ChEBML_1660631
Ki 490±n/a nM
Citation Mishra, CBKumari, SAngeli, AMonti, SMBuonanno, MTiwari, MSupuran, CT Discovery of Benzenesulfonamides with Potent Human Carbonic Anhydrase Inhibitory and Effective Anticonvulsant Action: Design, Synthesis, and Pharmacological Assessment. J Med Chem60:2456-2469 (2017) 
 
Carbonic anhydrase 7
Name:Carbonic anhydrase 7
Type:Enzyme
Mol. Mass.:29664.11
Organism:Homo sapiens (Human)
Description:Human cloned isozyme.
Residue:264
BDBM50237178
NameBDBM50237178
Synonyms:CHEMBL4068266
TypeSmall organic molecule
Emp. Form.C21H27N5O4S
Mol. Mass.445.535
SMILESCC(=O)c1ccc(cc1)N1CCN(CCNC(=O)Nc2ccc(cc2)S(N)(=O)=O)CC1