Reaction Details
TargetCarbonic anhydrase 7
LigandBDBM50237183
Substrate/Competitorn/a
Meas. Tech.ChEBML_1660631
Ki 6.5±n/a nM
Citation Mishra, CBKumari, SAngeli, AMonti, SMBuonanno, MTiwari, MSupuran, CT Discovery of Benzenesulfonamides with Potent Human Carbonic Anhydrase Inhibitory and Effective Anticonvulsant Action: Design, Synthesis, and Pharmacological Assessment. J Med Chem60:2456-2469 (2017) 
 
Carbonic anhydrase 7
Name:Carbonic anhydrase 7
Type:Enzyme
Mol. Mass.:29664.11
Organism:Homo sapiens (Human)
Description:Human cloned isozyme.
Residue:264
BDBM50237183
NameBDBM50237183
Synonyms:CHEMBL1518113
TypeSmall organic molecule
Emp. Form.C19H24N4O3S
Mol. Mass.388.484
SMILESNS(=O)(=O)c1ccc(NC(=O)CN2CCN(Cc3ccccc3)CC2)cc1