Reaction Details
TargetCarbonic anhydrase 2
LigandBDBM50237179
Substrate/Competitorn/a
Meas. Tech.ChEMBL_1660630 (CHEMBL4010242)
Ki 3.6±n/a nM
Citation Mishra, CBKumari, SAngeli, AMonti, SMBuonanno, MTiwari, MSupuran, CT Discovery of Benzenesulfonamides with Potent Human Carbonic Anhydrase Inhibitory and Effective Anticonvulsant Action: Design, Synthesis, and Pharmacological Assessment. J Med Chem60:2456-2469 (2017) 
 
Carbonic anhydrase 2
Name:Carbonic anhydrase 2
Type:Enzyme
Mol. Mass.:29250.71
Organism:Homo sapiens (Human)
Description:P00918
Residue:260
BDBM50237179
NameBDBM50237179
Synonyms:CHEMBL4097153
TypeSmall organic molecule
Emp. Form.C18H22N4O3S
Mol. Mass.374.457
SMILESNS(=O)(=O)c1ccc(NC(=O)CN2CCN(CC2)c2ccccc2)cc1