Reaction Details
TargetCarbonic anhydrase 7
LigandBDBM50237194
Substrate/Competitorn/a
Meas. Tech.ChEMBL_1660631 (CHEMBL4010243)
Ki 8.9±n/a nM
Citation Mishra, CBKumari, SAngeli, AMonti, SMBuonanno, MTiwari, MSupuran, CT Discovery of Benzenesulfonamides with Potent Human Carbonic Anhydrase Inhibitory and Effective Anticonvulsant Action: Design, Synthesis, and Pharmacological Assessment. J Med Chem60:2456-2469 (2017) 
 
Carbonic anhydrase 7
Name:Carbonic anhydrase 7
Type:Enzyme
Mol. Mass.:29664.11
Organism:Homo sapiens (Human)
Description:Human cloned isozyme.
Residue:264
BDBM50237194
NameBDBM50237194
Synonyms:CHEMBL4091108
TypeSmall organic molecule
Emp. Form.C25H28N4O3S
Mol. Mass.464.58
SMILESNS(=O)(=O)c1ccc(NC(=O)CN2CCN(CC2)C(c2ccccc2)c2ccccc2)cc1