Reaction Details
TargetCarbonic anhydrase 2
LigandBDBM50237183
Substrate/Competitorn/a
Meas. Tech.ChEMBL_1660630 (CHEMBL4010242)
Ki 4.9±n/a nM
Citation Mishra, CBKumari, SAngeli, AMonti, SMBuonanno, MTiwari, MSupuran, CT Discovery of Benzenesulfonamides with Potent Human Carbonic Anhydrase Inhibitory and Effective Anticonvulsant Action: Design, Synthesis, and Pharmacological Assessment. J Med Chem60:2456-2469 (2017) 
 
Carbonic anhydrase 2
Name:Carbonic anhydrase 2
Type:Enzyme
Mol. Mass.:29250.71
Organism:Homo sapiens (Human)
Description:P00918
Residue:260
BDBM50237183
NameBDBM50237183
Synonyms:CHEMBL1518113
TypeSmall organic molecule
Emp. Form.C19H24N4O3S
Mol. Mass.388.484
SMILESNS(=O)(=O)c1ccc(NC(=O)CN2CCN(Cc3ccccc3)CC2)cc1