Reaction Details
TargetCarbonic anhydrase 2
LigandBDBM50237181
Substrate/Competitorn/a
Meas. Tech.ChEMBL_1660630 (CHEMBL4010242)
Ki 29±n/a nM
Citation Mishra, CBKumari, SAngeli, AMonti, SMBuonanno, MTiwari, MSupuran, CT Discovery of Benzenesulfonamides with Potent Human Carbonic Anhydrase Inhibitory and Effective Anticonvulsant Action: Design, Synthesis, and Pharmacological Assessment. J Med Chem60:2456-2469 (2017) 
 
Carbonic anhydrase 2
Name:Carbonic anhydrase 2
Type:Enzyme
Mol. Mass.:29250.71
Organism:Homo sapiens (Human)
Description:P00918
Residue:260
BDBM50237181
NameBDBM50237181
Synonyms:CHEMBL4086993
TypeSmall organic molecule
Emp. Form.C18H21BrN4O3S
Mol. Mass.453.353
SMILESNS(=O)(=O)c1ccc(NC(=O)CN2CCN(CC2)c2ccc(Br)cc2)cc1