Reaction Details
TargetCarbonic anhydrase 12
LigandBDBM50237184
Substrate/Competitorn/a
Meas. Tech.ChEMBL_1660632 (CHEMBL4010244)
Ki 92±n/a nM
Citation Mishra, CBKumari, SAngeli, AMonti, SMBuonanno, MTiwari, MSupuran, CT Discovery of Benzenesulfonamides with Potent Human Carbonic Anhydrase Inhibitory and Effective Anticonvulsant Action: Design, Synthesis, and Pharmacological Assessment. J Med Chem60:2456-2469 (2017) 
 
Carbonic anhydrase 12
Name:Carbonic anhydrase 12
Type:Enzyme
Mol. Mass.:39456.00
Organism:Homo sapiens (Human)
Description:Catalytic domain of human cloned isozyme was used in the assay
Residue:354
BDBM50237184
NameBDBM50237184
Synonyms:CHEMBL4070147
TypeSmall organic molecule
Emp. Form.C19H22N4O4S
Mol. Mass.402.467
SMILESNS(=O)(=O)c1ccc(NC(=O)CN2CCN(CC2)C(=O)c2ccccc2)cc1