Reaction Details
TargetCarbonic anhydrase 1
LigandBDBM50237185
Substrate/Competitorn/a
Meas. Tech.ChEMBL_1660629 (CHEMBL4010241)
Ki 245±n/a nM
Citation Mishra, CBKumari, SAngeli, AMonti, SMBuonanno, MTiwari, MSupuran, CT Discovery of Benzenesulfonamides with Potent Human Carbonic Anhydrase Inhibitory and Effective Anticonvulsant Action: Design, Synthesis, and Pharmacological Assessment. J Med Chem60:2456-2469 (2017) 
 
Carbonic anhydrase 1
Name:Carbonic anhydrase 1
Type:Enzyme
Mol. Mass.:28873.37
Organism:Homo sapiens (Human)
Description:P00915
Residue:261
BDBM50237185
NameBDBM50237185
Synonyms:CHEMBL4061487
TypeSmall organic molecule
Emp. Form.C25H26F2N4O3S
Mol. Mass.500.561
SMILESNS(=O)(=O)c1ccc(NC(=O)CN2CCN(CC2)C(c2ccc(F)cc2)c2ccc(F)cc2)cc1