Reaction Details
TargetCytochrome P450 3A4
LigandBDBM50237506
Substrate/Competitorn/a
Meas. Tech.ChEMBL_1660136 (CHEMBL4009748)
IC50 270±n/a nM
Citation Wu, YJGuernon, JShi, JDitta, JRobbins, KJRajamani, REaston, ANewton, ABourin, CMosure, KSoars, MGKnox, RJMatchett, MPieschl, RLPost-Munson, DJWang, SHerrington, JGraef, JNewberry, KBristow, LJMeanwell, NAOlson, RThompson, LADzierba, C Development of New Benzenesulfonamides As Potent and Selective Na J Med Chem60:2513-2525 (2017) 
 
Cytochrome P450 3A4
Name:Cytochrome P450 3A4
Type:Enzyme
Mol. Mass.:57349.57
Organism:Homo sapiens (Human)
Description:n/a
Residue:503
BDBM50237506
NameBDBM50237506
Synonyms:CHEMBL4098912
TypeSmall organic molecule
Emp. Form.C22H24ClFN4O3S2
Mol. Mass.511.032
SMILESN[C@H]1CC[C@@](CCOc2cc(F)c(cc2Cl)S(=O)(=O)Nc2ncns2)(CC1)c1ccccc1