Reaction Details
TargetSodium channel protein type 9 subunit alpha
LigandBDBM50237514
Substrate/Competitorn/a
Meas. Tech.ChEMBL_1660138 (CHEMBL4009750)
IC50 69±n/a nM
Citation Wu, YJGuernon, JShi, JDitta, JRobbins, KJRajamani, REaston, ANewton, ABourin, CMosure, KSoars, MGKnox, RJMatchett, MPieschl, RLPost-Munson, DJWang, SHerrington, JGraef, JNewberry, KBristow, LJMeanwell, NAOlson, RThompson, LADzierba, C Development of New Benzenesulfonamides As Potent and Selective Na J Med Chem60:2513-2525 (2017) 
 
Sodium channel protein type 9 subunit alpha
Name:Sodium channel protein type 9 subunit alpha
Type:Protein
Mol. Mass.:226375.97
Organism:Homo sapiens (Human)
Description:Q15858
Residue:1988
BDBM50237514
NameBDBM50237514
Synonyms:CHEMBL4089010 | US10836758, Example 6
TypeSmall organic molecule
Emp. Form.C14H16ClFN4O3S2
Mol. Mass.406.883
SMILESFc1cc(NCC2CNCCO2)c(Cl)cc1S(=O)(=O)Nc1nccs1