Reaction Details
TargetSodium channel protein type 9 subunit alpha
LigandBDBM50237522
Substrate/Competitorn/a
Meas. Tech.ChEMBL_1660138 (CHEMBL4009750)
IC50 8±n/a nM
Citation Wu, YJGuernon, JShi, JDitta, JRobbins, KJRajamani, REaston, ANewton, ABourin, CMosure, KSoars, MGKnox, RJMatchett, MPieschl, RLPost-Munson, DJWang, SHerrington, JGraef, JNewberry, KBristow, LJMeanwell, NAOlson, RThompson, LADzierba, C Development of New Benzenesulfonamides As Potent and Selective Na J Med Chem60:2513-2525 (2017) 
 
Sodium channel protein type 9 subunit alpha
Name:Sodium channel protein type 9 subunit alpha
Type:Protein
Mol. Mass.:226375.97
Organism:Homo sapiens (Human)
Description:Q15858
Residue:1988
BDBM50237522
NameBDBM50237522
Synonyms:CHEMBL4060154 | US10836758, Example 17
TypeSmall organic molecule
Emp. Form.C17H22ClFN4O2S2
Mol. Mass.432.964
SMILESN[C@H]1CC[C@@H](CCNc2cc(F)c(cc2Cl)S(=O)(=O)Nc2nccs2)CC1