Reaction Details
TargetSodium channel protein type 9 subunit alpha
LigandBDBM50237513
Substrate/Competitorn/a
Meas. Tech.ChEMBL_1660138 (CHEMBL4009750)
IC50 105±n/a nM
Citation Wu, YJGuernon, JShi, JDitta, JRobbins, KJRajamani, REaston, ANewton, ABourin, CMosure, KSoars, MGKnox, RJMatchett, MPieschl, RLPost-Munson, DJWang, SHerrington, JGraef, JNewberry, KBristow, LJMeanwell, NAOlson, RThompson, LADzierba, C Development of New Benzenesulfonamides As Potent and Selective Na J Med Chem60:2513-2525 (2017) 
 
Sodium channel protein type 9 subunit alpha
Name:Sodium channel protein type 9 subunit alpha
Type:Protein
Mol. Mass.:226375.97
Organism:Homo sapiens (Human)
Description:Q15858
Residue:1988
BDBM50237513
NameBDBM50237513
Synonyms:CHEMBL4063378
TypeSmall organic molecule
Emp. Form.C25H28F2N4O3S2
Mol. Mass.534.642
SMILESFc1cc(c(F)cc1OCC[C@@]1(CC[C@@H](CC1)NC1CC1)c1ccccc1)S(=O)(=O)Nc1ncns1