Reaction Details
TargetP2Y purinoceptor 4
LigandBDBM50336790
Substrate/Competitorn/a
Meas. Tech.ChEBML_1661636
IC50 1510±n/a nM
Citation Rafehi, MMalik, EMNeumann, AAbdelrahman, AHanck, TNamasivayam, VMüller, CEBaqi, Y Development of Potent and Selective Antagonists for the UTP-Activated P2Y J Med Chem60:3020-3038 (2017) 
 
P2Y purinoceptor 4
Name:P2Y purinoceptor 4
Type:PROTEIN
Mol. Mass.:40977.17
Organism:Homo sapiens (Human)
Description:ChEMBL_751027
Residue:365
BDBM50336790
NameBDBM50336790
Synonyms:CHEMBL1671993 | Sodium 1-amino-4-(3-ethylphenylamino)-9,10-dioxo-9,10-dihydroanthracene-2-sulfonate
TypeSmall organic molecule
Emp. Form.C22H17N2O5S
Mol. Mass.421.446
SMILESCCc1cccc(Nc2cc(c(N)c3C(=O)c4ccccc4C(=O)c23)S([O-])(=O)=O)c1