Reaction Details
TargetP2Y purinoceptor 2
LigandBDBM50237574
Substrate/Competitorn/a
Meas. Tech.ChEMBL_1661641 (CHEMBL4011253)
IC50 6520±n/a nM
Citation Rafehi, MMalik, EMNeumann, AAbdelrahman, AHanck, TNamasivayam, VMüller, CEBaqi, Y Development of Potent and Selective Antagonists for the UTP-Activated P2Y J Med Chem60:3020-3038 (2017) 
 
P2Y purinoceptor 2
Name:P2Y purinoceptor 2
Type:PROTEIN
Mol. Mass.:42299.21
Organism:Homo sapiens (Human)
Description:ChEMBL_1455361
Residue:377
BDBM50237574
NameBDBM50237574
Synonyms:CHEMBL4081274
TypeSmall organic molecule
Emp. Form.C28H21N2NaO5S2
Mol. Mass.552.597
SMILES[Na+].Cc1ccc(C)c(Sc2ccc(Nc3cc(c(N)c4C(=O)c5ccccc5C(=O)c34)S([O-])(=O)=O)cc2)c1