Reaction Details
TargetP2Y purinoceptor 6
LigandBDBM50237573
Substrate/Competitorn/a
Meas. Tech.ChEMBL_1661642 (CHEMBL4011254)
IC50>100000±n/a nM
Citation Rafehi, MMalik, EMNeumann, AAbdelrahman, AHanck, TNamasivayam, VMüller, CEBaqi, Y Development of Potent and Selective Antagonists for the UTP-Activated P2Y J Med Chem60:3020-3038 (2017) 
 
P2Y purinoceptor 6
Name:P2Y purinoceptor 6
Type:PROTEIN
Mol. Mass.:36452.29
Organism:Homo sapiens (Human)
Description:ChEMBL_1511151
Residue:328
BDBM50237573
NameBDBM50237573
Synonyms:CHEMBL4090874
TypeSmall organic molecule
Emp. Form.C26H18N3NaO5S2
Mol. Mass.539.558
SMILES[Na+].Nc1c(cc(Nc2ccc(SCc3cccnc3)cc2)c2C(=O)c3ccccc3C(=O)c12)S([O-])(=O)=O