Reaction Details
TargetP2Y purinoceptor 4
LigandBDBM50227032
Substrate/Competitorn/a
Meas. Tech.ChEMBL_1661636 (CHEMBL4011248)
IC50 1970±n/a nM
Citation Rafehi, MMalik, EMNeumann, AAbdelrahman, AHanck, TNamasivayam, VMüller, CEBaqi, Y Development of Potent and Selective Antagonists for the UTP-Activated P2Y J Med Chem60:3020-3038 (2017) 
 
P2Y purinoceptor 4
Name:P2Y purinoceptor 4
Type:PROTEIN
Mol. Mass.:40977.17
Organism:Homo sapiens (Human)
Description:ChEMBL_751027
Residue:365
BDBM50227032
NameBDBM50227032
Synonyms:CHEMBL256057 sodium 1-amino-9,10-dioxo-4-(phenylamino)-9,10-dihydroanthracene-2-sulfonate
TypeSmall organic molecule
Emp. Form.C20H13N2O5S
Mol. Mass.393.393
SMILESNc1c2C(=O)c3ccccc3C(=O)c2c(Nc2ccccc2)cc1S([O-])(=O)=O