Reaction Details
TargetP2Y purinoceptor 4
LigandBDBM50237582
Substrate/Competitorn/a
Meas. Tech.ChEMBL_1661636 (CHEMBL4011248)
IC50 4130±n/a nM
Citation Rafehi, MMalik, EMNeumann, AAbdelrahman, AHanck, TNamasivayam, VMüller, CEBaqi, Y Development of Potent and Selective Antagonists for the UTP-Activated P2Y J Med Chem60:3020-3038 (2017) 
 
P2Y purinoceptor 4
Name:P2Y purinoceptor 4
Type:PROTEIN
Mol. Mass.:40977.17
Organism:Homo sapiens (Human)
Description:ChEMBL_751027
Residue:365
BDBM50237582
NameBDBM50237582
Synonyms:CHEMBL4072198
TypeSmall organic molecule
Emp. Form.C22H17N2NaO6S
Mol. Mass.460.435
SMILES[Na+].COc1cc(Nc2cc(c(N)c3C(=O)c4ccccc4C(=O)c23)S([O-])(=O)=O)ccc1C