Reaction Details
TargetP2Y purinoceptor 6
LigandBDBM50237576
Substrate/Competitorn/a
Meas. Tech.ChEMBL_1661642 (CHEMBL4011254)
IC50 4750±n/a nM
Citation Rafehi, MMalik, EMNeumann, AAbdelrahman, AHanck, TNamasivayam, VMüller, CEBaqi, Y Development of Potent and Selective Antagonists for the UTP-Activated P2Y J Med Chem60:3020-3038 (2017) 
 
P2Y purinoceptor 6
Name:P2Y purinoceptor 6
Type:PROTEIN
Mol. Mass.:36452.29
Organism:Homo sapiens (Human)
Description:ChEMBL_1511151
Residue:328
BDBM50237576
NameBDBM50237576
Synonyms:CHEMBL4069492
TypeSmall organic molecule
Emp. Form.C21H15N2NaO6S
Mol. Mass.446.408
SMILES[Na+].Cc1cc(Nc2cc(c(N)c3C(=O)c4ccccc4C(=O)c23)S([O-])(=O)=O)ccc1O