Reaction Details
TargetP2Y purinoceptor 4
LigandBDBM50336794
Substrate/Competitorn/a
Meas. Tech.ChEMBL_1661636 (CHEMBL4011248)
IC50 1390±n/a nM
Citation Rafehi, MMalik, EMNeumann, AAbdelrahman, AHanck, TNamasivayam, VMüller, CEBaqi, Y Development of Potent and Selective Antagonists for the UTP-Activated P2Y J Med Chem60:3020-3038 (2017) 
 
P2Y purinoceptor 4
Name:P2Y purinoceptor 4
Type:PROTEIN
Mol. Mass.:40977.17
Organism:Homo sapiens (Human)
Description:ChEMBL_751027
Residue:365
BDBM50336794
NameBDBM50336794
Synonyms:CHEMBL1671997 | Sodium 1-amino-4-(3-flourophenylamino)-9,10-dioxo-9,10-dihydroanthracene-2-sulfonate
TypeSmall organic molecule
Emp. Form.C20H12FN2O5S
Mol. Mass.411.384
SMILESNc1c(cc(Nc2cccc(F)c2)c2C(=O)c3ccccc3C(=O)c12)S([O-])(=O)=O