Reaction Details
TargetP2Y purinoceptor 12
LigandBDBM50237573
Substrate/Competitorn/a
Meas. Tech.ChEMBL_1661643 (CHEMBL4011255)
IC50 3590±n/a nM
Citation Rafehi, MMalik, EMNeumann, AAbdelrahman, AHanck, TNamasivayam, VMüller, CEBaqi, Y Development of Potent and Selective Antagonists for the UTP-Activated P2Y J Med Chem60:3020-3038 (2017) 
 
P2Y purinoceptor 12
Name:P2Y purinoceptor 12
Type:Enzyme
Mol. Mass.:39458.48
Organism:Homo sapiens (Human)
Description:Q9H244
Residue:342
BDBM50237573
NameBDBM50237573
Synonyms:CHEMBL4090874
TypeSmall organic molecule
Emp. Form.C26H18N3NaO5S2
Mol. Mass.539.558
SMILES[Na+].Nc1c(cc(Nc2ccc(SCc3cccnc3)cc2)c2C(=O)c3ccccc3C(=O)c12)S([O-])(=O)=O